BDBM89968 5-cyano-6-(2-methoxyphenoxy)-2-phenyl-3-pyridinecarboxylic acid ethyl ester::5-cyano-6-(2-methoxyphenoxy)-2-phenyl-nicotinic acid ethyl ester::MLS000326036::SMR000170171::cid_2769133::ethyl 5-cyano-6-(2-methoxyphenoxy)-2-phenyl-pyridine-3-carboxylate::ethyl 5-cyano-6-(2-methoxyphenoxy)-2-phenylnicotinate::ethyl 5-cyano-6-(2-methoxyphenoxy)-2-phenylpyridine-3-carboxylate
SMILES CCOC(=O)c1cc(C#N)c(Oc2ccccc2OC)nc1-c1ccccc1
InChI Key InChIKey=ZIPQMFCKSSOUFP-UHFFFAOYSA-N
Data  1 EC50
  Tab Delimited (TSV)   2D SDfile   Computed 3D by Vconf -m prep SDfile
Find this compound or compounds like it in BindingDB:
Activity Spreadsheet -- Enzyme Inhibition Constant Data from BindingDB
Found 1 hit for monomerid = 89968
TargetCorticotropin-releasing factor-binding protein(Homo sapiens (Human))
Burnham Center For Chemical Genomics
Curated by PubChem BioAssay
LigandPNGBDBM89968(5-cyano-6-(2-methoxyphenoxy)-2-phenyl-3-pyridineca...)
Affinity DataEC50: >5.30E+4nM. Assay description: Data Source: Sanford-Burnham Center for Chemical Genomics (SBCCG) Source Affiliation: Sanford-Burnham Medical Research Institute (SBMRI, San Diego, C...
In DepthDetails PCBioAssay