BDBM90004 5-(4-chlorophenyl)sulfonyl-4-(2,4-dichlorophenyl)-N,N-dimethyl-2-pyrimidinamine::5-(4-chlorophenyl)sulfonyl-4-(2,4-dichlorophenyl)-N,N-dimethyl-pyrimidin-2-amine::5-(4-chlorophenyl)sulfonyl-4-(2,4-dichlorophenyl)-N,N-dimethylpyrimidin-2-amine::MLS000325695::N-[5-[(4-chlorophenyl)sulfonyl]-4-(2,4-dichlorophenyl)-2-pyrimidinyl]-N,N-dimethylamine::SMR000169647::[5-(4-chlorophenyl)sulfonyl-4-(2,4-dichlorophenyl)pyrimidin-2-yl]-dimethyl-amine::cid_1488344
SMILES CN(C)c1ncc(c(n1)-c1ccc(Cl)cc1Cl)S(=O)(=O)c1ccc(Cl)cc1
InChI Key InChIKey=ALSLDYJTFGXFLD-UHFFFAOYSA-N
Data  1 EC50
  Tab Delimited (TSV)   2D SDfile   Computed 3D by Vconf -m prep SDfile
Find this compound or compounds like it in BindingDB:
Activity Spreadsheet -- Enzyme Inhibition Constant Data from BindingDB
Found 1 hit for monomerid = 90004
TargetCorticotropin-releasing factor-binding protein(Homo sapiens (Human))
Burnham Center For Chemical Genomics
Curated by PubChem BioAssay
LigandPNGBDBM90004(5-(4-chlorophenyl)sulfonyl-4-(2,4-dichlorophenyl)-...)
Affinity DataEC50: >5.30E+4nM. Assay description: Data Source: Sanford-Burnham Center for Chemical Genomics (SBCCG) Source Affiliation: Sanford-Burnham Medical Research Institute (SBMRI, San Diego, C...
In DepthDetails PCBioAssay