BDBM90027 4-methoxy-N-(2,2,2-trichloro-1-phenoxy-ethyl)benzamide::4-methoxy-N-(2,2,2-trichloro-1-phenoxyethyl)benzamide::4-methoxy-N-[2,2,2-tris(chloranyl)-1-phenoxy-ethyl]benzamide::MLS000573763::SMR000184614::cid_2831347
SMILES COc1ccc(cc1)C(=O)NC(Oc1ccccc1)C(Cl)(Cl)Cl
InChI Key InChIKey=TUBYKRSKRNOTCQ-UHFFFAOYSA-N
Data  1 IC50  1 EC50
  Tab Delimited (TSV)   2D SDfile   Computed 3D by Vconf -m prep SDfile
Find this compound or compounds like it in BindingDB:
Activity Spreadsheet -- Enzyme Inhibition Constant Data from BindingDB
Found 2 hits for monomerid = 90027
TargetCorticotropin-releasing factor-binding protein(Homo sapiens (Human))
Burnham Center For Chemical Genomics
Curated by PubChem BioAssay
LigandPNGBDBM90027(4-methoxy-N-(2,2,2-trichloro-1-phenoxy-ethyl)benza...)
Affinity DataIC50:  1.45E+4nM
In DepthDetails PCBioAssay
TargetCorticotropin-releasing factor-binding protein(Homo sapiens (Human))
Burnham Center For Chemical Genomics
Curated by PubChem BioAssay
LigandPNGBDBM90027(4-methoxy-N-(2,2,2-trichloro-1-phenoxy-ethyl)benza...)
Affinity DataEC50: >5.30E+4nM. Assay description: Data Source: Sanford-Burnham Center for Chemical Genomics (SBCCG) Source Affiliation: Sanford-Burnham Medical Research Institute (SBMRI, San Diego, C...
In DepthDetails PCBioAssay