BDBM90029 1-(4,5-Dimethoxy-2-nitro-benzyl)-4-(3-methoxy-benzyl)-piperazine::1-(4,5-dimethoxy-2-nitro-benzyl)-4-m-anisyl-piperazine;oxalic acid::1-[(4,5-dimethoxy-2-nitro-phenyl)methyl]-4-[(3-methoxyphenyl)methyl]piperazine;ethanedioic acid::1-[(4,5-dimethoxy-2-nitrophenyl)methyl]-4-[(3-methoxyphenyl)methyl]piperazine;oxalic acid::MLS000563272::SMR000177095::cid_11958885
SMILES COc1cccc(CN2CCN(Cc3cc(OC)c(OC)cc3[N+]([O-])=O)CC2)c1
InChI Key InChIKey=ZOPHRUFFEROWLT-UHFFFAOYSA-N
Data  1 EC50
  Tab Delimited (TSV)   2D SDfile   Computed 3D by Vconf -m prep SDfile
Find this compound or compounds like it in BindingDB:
Activity Spreadsheet -- Enzyme Inhibition Constant Data from BindingDB
Found 1 hit for monomerid = 90029
TargetCorticotropin-releasing factor-binding protein(Homo sapiens (Human))
Burnham Center For Chemical Genomics
Curated by PubChem BioAssay
LigandPNGBDBM90029(1-(4,5-Dimethoxy-2-nitro-benzyl)-4-(3-methoxy-benz...)
Affinity DataEC50: >5.30E+4nM. Assay description: Data Source: Sanford-Burnham Center for Chemical Genomics (SBCCG) Source Affiliation: Sanford-Burnham Medical Research Institute (SBMRI, San Diego, C...
In DepthDetails PCBioAssay