BDBM90103 6-Hexyl-7-hydroxy-2-oxo-2H-chromene-3-carboxylic acid (2-methoxy-phenyl)-amide::6-hexyl-7-hydroxy-2-keto-N-(2-methoxyphenyl)chromene-3-carboxamide::6-hexyl-7-hydroxy-N-(2-methoxyphenyl)-2-oxo-1-benzopyran-3-carboxamide::6-hexyl-7-hydroxy-N-(2-methoxyphenyl)-2-oxochromene-3-carboxamide::6-hexyl-N-(2-methoxyphenyl)-7-oxidanyl-2-oxidanylidene-chromene-3-carboxamide::MLS000553529::SMR000171774::cid_5598240
SMILES CCCCCCc1cc2cc(C(=O)Nc3ccccc3OC)c(=O)oc2cc1O
InChI Key InChIKey=OSRUQNAFDCVLCZ-UHFFFAOYSA-N
Data  1 EC50
  Tab Delimited (TSV)   2D SDfile   Computed 3D by Vconf -m prep SDfile
Find this compound or compounds like it in BindingDB:
Activity Spreadsheet -- Enzyme Inhibition Constant Data from BindingDB
Found 1 hit for monomerid = 90103
TargetCorticotropin-releasing factor-binding protein(Homo sapiens (Human))
Burnham Center For Chemical Genomics
Curated by PubChem BioAssay
LigandPNGBDBM90103(6-Hexyl-7-hydroxy-2-oxo-2H-chromene-3-carboxylic a...)
Affinity DataEC50:  1.97E+3nM. Assay description: Data Source: Sanford-Burnham Center for Chemical Genomics (SBCCG) Source Affiliation: Sanford-Burnham Medical Research Institute (SBMRI, San Diego, C...
In DepthDetails PCBioAssay