BDBM90487 1,3-dimethyl-5-[(5-morpholin-4-ylfuran-2-yl)methylidene]-2-sulfanylidene-1,3-diazinane-4,6-dione::1,3-dimethyl-5-[(5-morpholino-2-furyl)methylene]-2-thioxo-hexahydropyrimidine-4,6-quinone::1,3-dimethyl-5-[[5-(4-morpholinyl)-2-furanyl]methylidene]-2-sulfanylidene-1,3-diazinane-4,6-dione::MLS000693106::SMR000284738::cid_817730
SMILES [#6]-[#7]-1-[#6](=S)-[#7](-[#6])-[#6](=O)\[#6](=[#6]\c2ccc(o2)-[#7]-2-[#6]-[#6]-[#8]-[#6]-[#6]-2)-[#6]-1=O
InChI Key InChIKey=VMCFEMPCUSAJLD-UHFFFAOYSA-N
Data  1 EC50
  Tab Delimited (TSV)   2D SDfile   Computed 3D by Vconf -m prep SDfile
Find this compound or compounds like it in BindingDB:
Activity Spreadsheet -- Enzyme Inhibition Constant Data from BindingDB
Found 1 hit for monomerid = 90487
TargetCorticotropin-releasing factor-binding protein(Homo sapiens (Human))
Burnham Center For Chemical Genomics
Curated by PubChem BioAssay
LigandPNGBDBM90487(1,3-dimethyl-5-[(5-morpholin-4-ylfuran-2-yl)methyl...)
Affinity DataEC50:  7.57E+3nM. Assay description: Data Source: Sanford-Burnham Center for Chemical Genomics (SBCCG) Source Affiliation: Sanford-Burnham Medical Research Institute (SBMRI, San Diego, C...
In DepthDetails PCBioAssay