BDBM90490 (3-bromophenyl)-[(2-methoxyphenoxy)-methyl-phosphoryl]amine::3-bromanyl-N-[(2-methoxyphenoxy)-methyl-phosphoryl]aniline::3-bromo-N-[(2-methoxyphenoxy)-methylphosphoryl]aniline::MLS000712602::SMR000282369::cid_1049520
SMILES COc1ccccc1OP(C)(=O)Nc1cccc(Br)c1
InChI Key InChIKey=GGAVBASRIWXGOJ-UHFFFAOYSA-N
Data  1 EC50
  Tab Delimited (TSV)   2D SDfile   Computed 3D by Vconf -m prep SDfile
Find this compound or compounds like it in BindingDB:
Activity Spreadsheet -- Enzyme Inhibition Constant Data from BindingDB
Found 1 hit for monomerid = 90490
TargetCorticotropin-releasing factor-binding protein(Homo sapiens (Human))
Burnham Center For Chemical Genomics
Curated by PubChem BioAssay
LigandPNGBDBM90490((3-bromophenyl)-[(2-methoxyphenoxy)-methyl-phospho...)
Affinity DataEC50:  2.54E+3nM. Assay description: Data Source: Sanford-Burnham Center for Chemical Genomics (SBCCG) Source Affiliation: Sanford-Burnham Medical Research Institute (SBMRI, San Diego, C...
In DepthDetails PCBioAssay