BDBM90545 3-N,3-N,5-N,5-N-tetramethyl-1-[3-(trifluoromethyl)phenyl]sulfonyl-1,2,4-triazole-3,5-diamine::MLS000755131::N3,N3,N5,N5-tetramethyl-1-[3-(trifluoromethyl)phenyl]sulfonyl-1,2,4-triazole-3,5-diamine::N~3~,N~3~,N~5~,N~5~-tetramethyl-1-{[3-(trifluoromethyl)phenyl]sulfonyl}-1H-1,2,4-triazole-3,5-diamine::SMR000337991::[5-(dimethylamino)-1-[3-(trifluoromethyl)phenyl]sulfonyl-1,2,4-triazol-3-yl]-dimethyl-amine::cid_1488378
SMILES CN(C)c1nc(N(C)C)n(n1)S(=O)(=O)c1cccc(c1)C(F)(F)F
InChI Key InChIKey=NUKFPHZUWRCJGT-UHFFFAOYSA-N
Data  1 EC50
  Tab Delimited (TSV)   2D SDfile   Computed 3D by Vconf -m prep SDfile
Find this compound or compounds like it in BindingDB:
Activity Spreadsheet -- Enzyme Inhibition Constant Data from BindingDB
Found 1 hit for monomerid = 90545
TargetCorticotropin-releasing factor-binding protein(Homo sapiens (Human))
Burnham Center For Chemical Genomics
Curated by PubChem BioAssay
LigandPNGBDBM90545(3-N,3-N,5-N,5-N-tetramethyl-1-[3-(trifluoromethyl)...)
Affinity DataEC50: >5.30E+4nM. Assay description: Data Source: Sanford-Burnham Center for Chemical Genomics (SBCCG) Source Affiliation: Sanford-Burnham Medical Research Institute (SBMRI, San Diego, C...
In DepthDetails PCBioAssay