BDBM90607 4-[2-(6-amino-1-benzyl-2,4-diketo-3-methyl-pyrimidin-5-yl)-2-keto-ethoxy]benzonitrile::4-[2-(6-amino-1-benzyl-3-methyl-2,4-dioxopyrimidin-5-yl)-2-oxoethoxy]benzonitrile::4-[2-[4-amino-1-methyl-2,6-dioxo-3-(phenylmethyl)-5-pyrimidinyl]-2-oxoethoxy]benzonitrile::4-[2-[4-azanyl-1-methyl-2,6-bis(oxidanylidene)-3-(phenylmethyl)pyrimidin-5-yl]-2-oxidanylidene-ethoxy]benzenecarbonitrile::MLS001018867::SMR000385338::cid_2086676
SMILES Cn1c(=O)c(C(=O)COc2ccc(cc2)C#N)c(N)n(Cc2ccccc2)c1=O
InChI Key InChIKey=FVBDGWCLWDOGFC-UHFFFAOYSA-N
Data  1 EC50
  Tab Delimited (TSV)   2D SDfile   Computed 3D by Vconf -m prep SDfile
Find this compound or compounds like it in BindingDB:
Activity Spreadsheet -- Enzyme Inhibition Constant Data from BindingDB
Found 1 hit for monomerid = 90607
TargetCorticotropin-releasing factor-binding protein(Homo sapiens (Human))
Burnham Center For Chemical Genomics
Curated by PubChem BioAssay
LigandPNGBDBM90607(4-[2-(6-amino-1-benzyl-2,4-diketo-3-methyl-pyrimid...)
Affinity DataEC50:  1.09E+4nM. Assay description: Data Source: Sanford-Burnham Center for Chemical Genomics (SBCCG) Source Affiliation: Sanford-Burnham Medical Research Institute (SBMRI, San Diego, C...
Ligand InfoPC cidPC sid
In DepthDetails PCBioAssay