BDBM90714 (5E)-1-(3-methylphenyl)-5-[(4-morpholin-4-ylphenyl)methylidene]-1,3-diazinane-2,4,6-trione::(5E)-1-(3-methylphenyl)-5-[[4-(4-morpholinyl)phenyl]methylidene]-1,3-diazinane-2,4,6-trione::(5E)-5-(4-morpholinobenzylidene)-1-(m-tolyl)barbituric acid::5-[1-(4-Morpholin-4-yl-phenyl)-meth-(E)-ylidene]-1-m-tolyl-pyrimidine-2,4,6-trione::MLS000333681::SMR000437849::cid_1625240
SMILES Cc1cccc(c1)N1C(=O)NC(=O)C(=Cc2ccc(cc2)N2CCOCC2)C1=O
InChI Key InChIKey=UQYCYBDMYRTGPX-UHFFFAOYSA-N
Data  1 EC50
  Tab Delimited (TSV)   2D SDfile   Computed 3D by Vconf -m prep SDfile
Find this compound or compounds like it in BindingDB:
Activity Spreadsheet -- Enzyme Inhibition Constant Data from BindingDB
Found 1 hit for monomerid = 90714
TargetCorticotropin-releasing factor-binding protein(Homo sapiens (Human))
Burnham Center For Chemical Genomics
Curated by PubChem BioAssay
LigandPNGBDBM90714((5E)-1-(3-methylphenyl)-5-[(4-morpholin-4-ylphenyl...)
Affinity DataEC50: >5.30E+4nM. Assay description: Data Source: Sanford-Burnham Center for Chemical Genomics (SBCCG) Source Affiliation: Sanford-Burnham Medical Research Institute (SBMRI, San Diego, C...
In DepthDetails PCBioAssay