BDBM90820 2-(4,6-dimethyl-2-pyrimidinyl)-1-(4-ethoxyphenyl)guanidine::2-(4,6-dimethylpyrimidin-2-yl)-1-(4-ethoxyphenyl)guanidine::2-(4,6-dimethylpyrimidin-2-yl)-1-p-phenetyl-guanidine::MLS001210132::N-(4,6-Dimethyl-pyrimidin-2-yl)-N'-(4-ethoxy-phenyl)-guanidine::SMR000515717::cid_5726591
SMILES CCOc1ccc(cc1)N=C(N)Nc1nc(C)cc(C)n1
InChI Key InChIKey=IOQYOCMKUMXUQQ-UHFFFAOYSA-N
Data  1 EC50
  Tab Delimited (TSV)   2D SDfile   Computed 3D by Vconf -m prep SDfile
Find this compound or compounds like it in BindingDB:
Activity Spreadsheet -- Enzyme Inhibition Constant Data from BindingDB
Found 1 hit for monomerid = 90820
TargetCorticotropin-releasing factor-binding protein(Homo sapiens (Human))
Burnham Center For Chemical Genomics
Curated by PubChem BioAssay
LigandPNGBDBM90820(2-(4,6-dimethyl-2-pyrimidinyl)-1-(4-ethoxyphenyl)g...)
Affinity DataEC50:  6.95E+3nM. Assay description: Data Source: Sanford-Burnham Center for Chemical Genomics (SBCCG) Source Affiliation: Sanford-Burnham Medical Research Institute (SBMRI, San Diego, C...
In DepthDetails PCBioAssay