BDBM90841 1-N,3-N-bis(2,4-dimethoxyphenyl)-5-nitrobenzene-1,3-dicarboxamide::MLS001205060::N,N'-Bis-(2,4-dimethoxy-phenyl)-5-nitro-isophthalamide::N,N'-bis(2,4-dimethoxyphenyl)-5-nitro-isophthalamide::N1,N3-bis(2,4-dimethoxyphenyl)-5-nitro-benzene-1,3-dicarboxamide::N1,N3-bis(2,4-dimethoxyphenyl)-5-nitrobenzene-1,3-dicarboxamide::SMR000516200::cid_1116126
SMILES COc1ccc(NC(=O)c2cc(cc(c2)[N+]([O-])=O)C(=O)Nc2ccc(OC)cc2OC)c(OC)c1
InChI Key InChIKey=AKHSJMMJALKRRW-UHFFFAOYSA-N
Data  1 EC50
  Tab Delimited (TSV)   2D SDfile   Computed 3D by Vconf -m prep SDfile
Find this compound or compounds like it in BindingDB:
Activity Spreadsheet -- Enzyme Inhibition Constant Data from BindingDB
Found 1 hit for monomerid = 90841
TargetCorticotropin-releasing factor-binding protein(Homo sapiens (Human))
Burnham Center For Chemical Genomics
Curated by PubChem BioAssay
LigandPNGBDBM90841(1-N,3-N-bis(2,4-dimethoxyphenyl)-5-nitrobenzene-1,...)
Affinity DataEC50: >5.30E+4nM. Assay description: Data Source: Sanford-Burnham Center for Chemical Genomics (SBCCG) Source Affiliation: Sanford-Burnham Medical Research Institute (SBMRI, San Diego, C...
In DepthDetails PCBioAssay