BDBM90856 1-(4-chlorophenyl)-5-methoxy-2-methyl-1H-indole-3-carboxylic acid::1-(4-chlorophenyl)-5-methoxy-2-methyl-3-indolecarboxylic acid::1-(4-chlorophenyl)-5-methoxy-2-methyl-indole-3-carboxylic acid::1-(4-chlorophenyl)-5-methoxy-2-methylindole-3-carboxylic acid::MLS001197368::SMR000555253::cid_744721
SMILES COc1ccc2n(c(C)c(C(O)=O)c2c1)-c1ccc(Cl)cc1
InChI Key InChIKey=JDDYWRZEGDOCSH-UHFFFAOYSA-N
Data  1 EC50
  Tab Delimited (TSV)   2D SDfile   Computed 3D by Vconf -m prep SDfile
Find this compound or compounds like it in BindingDB:
Activity Spreadsheet -- Enzyme Inhibition Constant Data from BindingDB
Found 1 hit for monomerid = 90856
TargetCorticotropin-releasing factor-binding protein(Homo sapiens (Human))
Burnham Center For Chemical Genomics
Curated by PubChem BioAssay
LigandPNGBDBM90856(1-(4-chlorophenyl)-5-methoxy-2-methyl-1H-indole-3-...)
Affinity DataEC50: >5.30E+4nM. Assay description: Data Source: Sanford-Burnham Center for Chemical Genomics (SBCCG) Source Affiliation: Sanford-Burnham Medical Research Institute (SBMRI, San Diego, C...
In DepthDetails PCBioAssay