BDBM90964 MLS001095149::N-cyclohexyl-3-[(2-keto-3-methyl-1,3-benzoxazol-6-yl)sulfonyl]-N-methyl-propionamide::N-cyclohexyl-N-methyl-3-[(3-methyl-2-oxidanylidene-1,3-benzoxazol-6-yl)sulfonyl]propanamide::N-cyclohexyl-N-methyl-3-[(3-methyl-2-oxo-1,3-benzoxazol-6-yl)sulfonyl]propanamide::SMR000630257::cid_20927567
SMILES CN(C1CCCCC1)C(=O)CCS(=O)(=O)c1ccc2n(C)c(=O)oc2c1
InChI Key InChIKey=MWZBKRYZUPQCHA-UHFFFAOYSA-N
Data  1 EC50
  Tab Delimited (TSV)   2D SDfile   Computed 3D by Vconf -m prep SDfile
Find this compound or compounds like it in BindingDB:
Activity Spreadsheet -- Enzyme Inhibition Constant Data from BindingDB
Found 1 hit for monomerid = 90964
TargetCorticotropin-releasing factor-binding protein(Homo sapiens (Human))
Burnham Center For Chemical Genomics
Curated by PubChem BioAssay
LigandPNGBDBM90964(MLS001095149 | N-cyclohexyl-3-[(2-keto-3-methyl-1,...)
Affinity DataEC50: >5.30E+4nM. Assay description: Data Source: Sanford-Burnham Center for Chemical Genomics (SBCCG) Source Affiliation: Sanford-Burnham Medical Research Institute (SBMRI, San Diego, C...
Ligand InfoPC cidPC sid
In DepthDetails PCBioAssay