BDBM91156 4-[(2-cyano-1-oxoethyl)amino]benzoic acid [2-oxo-2-[[oxo(thiophen-2-yl)methyl]hydrazo]ethyl] ester::4-[(2-cyanoacetyl)amino]benzoic acid [2-keto-2-[N'-(2-thenoyl)hydrazino]ethyl] ester::MLS001077444::SMR000706552::[2-oxidanylidene-2-(2-thiophen-2-ylcarbonylhydrazinyl)ethyl] 4-(2-cyanoethanoylamino)benzoate::[2-oxo-2-[2-(thiophene-2-carbonyl)hydrazinyl]ethyl] 4-[(2-cyanoacetyl)amino]benzoate::cid_8850233
SMILES O=C(COC(=O)c1ccc(NC(=O)CC#N)cc1)NNC(=O)c1cccs1
InChI Key InChIKey=JTPDGOVBPGIHLP-UHFFFAOYSA-N
Data  1 EC50
  Tab Delimited (TSV)   2D SDfile   Computed 3D by Vconf -m prep SDfile
Find this compound or compounds like it in BindingDB:
Activity Spreadsheet -- Enzyme Inhibition Constant Data from BindingDB
Found 1 hit for monomerid = 91156
TargetCorticotropin-releasing factor-binding protein(Homo sapiens (Human))
Burnham Center For Chemical Genomics
Curated by PubChem BioAssay
LigandPNGBDBM91156(4-[(2-cyano-1-oxoethyl)amino]benzoic acid [2-oxo-2...)
Affinity DataEC50: >5.30E+4nM. Assay description: Data Source: Sanford-Burnham Center for Chemical Genomics (SBCCG) Source Affiliation: Sanford-Burnham Medical Research Institute (SBMRI, San Diego, C...
In DepthDetails PCBioAssay