BDBM91217 2-methyl-5-(4-morpholinylsulfonyl)-N-[1-(phenylmethyl)-4-piperidinyl]benzamide::2-methyl-5-morpholin-4-ylsulfonyl-N-[1-(phenylmethyl)piperidin-4-yl]benzamide::MLS002181077::N-(1-benzyl-4-piperidyl)-2-methyl-5-morpholinosulfonyl-benzamide::N-(1-benzylpiperidin-4-yl)-2-methyl-5-morpholin-4-ylsulfonylbenzamide::SMR001270107::cid_25162810
SMILES Cc1ccc(cc1C(=O)NC1CCN(Cc2ccccc2)CC1)S(=O)(=O)N1CCOCC1
InChI Key InChIKey=KYQXQVUAEGSSAF-UHFFFAOYSA-N
Data  1 EC50
  Tab Delimited (TSV)   2D SDfile   Computed 3D by Vconf -m prep SDfile
Find this compound or compounds like it in BindingDB:
Activity Spreadsheet -- Enzyme Inhibition Constant Data from BindingDB
Found 1 hit for monomerid = 91217
TargetCorticotropin-releasing factor-binding protein(Homo sapiens (Human))
Burnham Center For Chemical Genomics
Curated by PubChem BioAssay
LigandPNGBDBM91217(2-methyl-5-(4-morpholinylsulfonyl)-N-[1-(phenylmet...)
Affinity DataEC50: >5.30E+4nM. Assay description: Data Source: Sanford-Burnham Center for Chemical Genomics (SBCCG) Source Affiliation: Sanford-Burnham Medical Research Institute (SBMRI, San Diego, C...
Ligand InfoPC cidPC sid
In DepthDetails PCBioAssay