BDBM91251 MLS002171107::N-(2-ethoxyphenyl)-1-[2-(trifluoromethyl)phenyl]sulfonyl-2-pyrrolidinecarboxamide::N-(2-ethoxyphenyl)-1-[2-(trifluoromethyl)phenyl]sulfonyl-pyrrolidine-2-carboxamide::N-(2-ethoxyphenyl)-1-[2-(trifluoromethyl)phenyl]sulfonylpyrrolidine-2-carboxamide::N-o-phenetyl-1-[2-(trifluoromethyl)phenyl]sulfonyl-pyrrolidine-2-carboxamide::SMR001251407::cid_4528778
SMILES CCOc1ccccc1NC(=O)C1CCCN1S(=O)(=O)c1ccccc1C(F)(F)F
InChI Key InChIKey=YYGYVECHOYGHIP-UHFFFAOYSA-N
Data  1 EC50
  Tab Delimited (TSV)   2D SDfile   Computed 3D by Vconf -m prep SDfile
Find this compound or compounds like it in BindingDB:
Activity Spreadsheet -- Enzyme Inhibition Constant Data from BindingDB
Found 1 hit for monomerid = 91251
TargetCorticotropin-releasing factor-binding protein(Homo sapiens (Human))
Burnham Center For Chemical Genomics
Curated by PubChem BioAssay
LigandPNGBDBM91251(MLS002171107 | N-(2-ethoxyphenyl)-1-[2-(trifluorom...)
Affinity DataEC50: >5.30E+4nM. Assay description: Data Source: Sanford-Burnham Center for Chemical Genomics (SBCCG) Source Affiliation: Sanford-Burnham Medical Research Institute (SBMRI, San Diego, C...
In DepthDetails PCBioAssay