BDBM91546 3-(2-furanyl)-5-(4-methoxyphenyl)-2-phenyl-3,4-dihydropyrazole::3-(furan-2-yl)-5-(4-methoxyphenyl)-2-phenyl-3,4-dihydropyrazole::5-(2-furyl)-3-(4-methoxyphenyl)-1-phenyl-2-pyrazoline::VU0466995-1::cid_2933097
SMILES COc1ccc(cc1)C1=NN(C(C1)c1ccco1)c1ccccc1
InChI Key InChIKey=KPIASEIOCUARJB-UHFFFAOYSA-N
Data  3 EC50
  Tab Delimited (TSV)   2D SDfile   Computed 3D by Vconf -m prep SDfile
Find this compound or compounds like it in BindingDB:
Activity Spreadsheet -- Enzyme Inhibition Constant Data from BindingDB
Found 3 hits for monomerid = 91546
TargetBotulinum neurotoxin type A(Clostridium botulinum (strain Hall / ATCC 3502 / N...)
Nmmlsc
Curated by PubChem BioAssay
LigandPNGBDBM91546(3-(2-furanyl)-5-(4-methoxyphenyl)-2-phenyl-3,4-dih...)
Affinity DataEC50: >2.00E+4nM. Assay description: University of New Mexico Assay Overview: Assay Support: 1 R03 MH093184-01A1 Project Title: High-throughput multiplex microsphere screening for tox...
In DepthDetails PCBioAssay
TargetBotulinum neurotoxin type F(Clostridium botulinum Bf)
Nmmlsc
Curated by PubChem BioAssay
LigandPNGBDBM91546(3-(2-furanyl)-5-(4-methoxyphenyl)-2-phenyl-3,4-dih...)
Affinity DataEC50: >2.00E+4nM. Assay description: University of New Mexico Assay Overview: Assay Support: 1 R03 MH093184-01A1 Project Title: High-throughput multiplex microsphere screening for tox...
In DepthDetails PCBioAssay
TargetLethal factor(Bacillus anthracis)
Nmmlsc
Curated by PubChem BioAssay
LigandPNGBDBM91546(3-(2-furanyl)-5-(4-methoxyphenyl)-2-phenyl-3,4-dih...)
Affinity DataEC50: >2.00E+4nM. Assay description: University of New Mexico Assay Overview: Assay Support: 1 R03 MH093184-01A1 Project Title: High-throughput multiplex microsphere screening for tox...
In DepthDetails PCBioAssay