BDBM92146 erk000594
SMILES Oc1cccc(Nc2nccc(n2)-c2sc(NCC[NH+]3CCCCC3)c(C#N)c2-c2cccc(Cl)c2)c1
InChI Key InChIKey=PNULACZBCYZZLG-UHFFFAOYSA-O
Data  2 KI
  Tab Delimited (TSV)   2D SDfile   Computed 3D by Vconf -m prep SDfile
Find this compound or compounds like it in BindingDB:
Activity Spreadsheet -- Enzyme Inhibition Constant Data from BindingDB
Found 2 hits for monomerid = 92146
TargetMitogen-activated protein kinase 1(Homo sapiens (Human))
D3R/Abbott
LigandPNGBDBM92146(erk000594)
Affinity DataKi:  26.9nM. Assay description: Photometric_Method2
Ligand InfoPC cidPC sid
In DepthDetails PubMed
TargetMitogen-activated protein kinase 1(Homo sapiens (Human))
D3R/Abbott
LigandPNGBDBM92146(erk000594)
Affinity DataKi:  27nM. Assay description: Assay 1 ...
Ligand InfoPC cidPC sid
In DepthDetails PubMed