BDBM92178 erk000633
SMILES O=c1[nH][nH]c2cc(Nc3ncc(Nc4ccccc4)c(Nc4cc(n[nH]4)C4CC4)n3)ccc12
InChI Key InChIKey=IDHDCLHNVFXALQ-UHFFFAOYSA-N
Data  1 KI
PDB links: 1 PDB ID matches this monomer.
  Tab Delimited (TSV)   2D SDfile   Computed 3D by Vconf -m prep SDfile
Find this compound or compounds like it in BindingDB:
Activity Spreadsheet -- Enzyme Inhibition Constant Data from BindingDB
Found 1 hit for monomerid = 92178
TargetMitogen-activated protein kinase 1(Homo sapiens (Human))
Csar
LigandPNGBDBM92178(erk000633)
Affinity DataKi:  15nM. Assay description: Assay 1 ...