BDBM92246 erk000715
SMILES CC[C@@H](COC(=O)[C@@H]([NH2+]C)C(C)C)Nc1ncc(C)c(n1)-c1c[nH]c(c1)C(=O)N[C@H](COC(=O)[C@@H]([NH2+]C)C(C)C)c1cccc(Cl)c1
InChI Key InChIKey=KIRRQJQTNDYTKP-JKWLULBVSA-P
Data  2 KI
  Tab Delimited (TSV)   2D SDfile   Computed 3D by Vconf -m prep SDfile
Find this compound or compounds like it in BindingDB:
Activity Spreadsheet -- Enzyme Inhibition Constant Data from BindingDB
Found 2 hits for monomerid = 92246
TargetMitogen-activated protein kinase 1(Homo sapiens (Human))
Csar
LigandPNGBDBM92246(erk000715)
Affinity DataKi:  1.91E+3nM. Assay description: Assay 1 ...
In DepthDetails PubMed
TargetMitogen-activated protein kinase 1(Homo sapiens (Human))
Csar
LigandPNGBDBM92246(erk000715)
Affinity DataKi:  1.91E+3nM. Assay description: Photometric_Method2
In DepthDetails PubMed