BDBM92269 CS259
SMILES C[C@@H](O)[C@H](NC(=O)c1ccc(cc1)C#Cc1ccccc1)C(=O)NO
InChI Key InChIKey=SFYISUPIFOZKLQ-DYVFJYSZSA-N
Data  1 KI  3 Kd
PDB links: 1 PDB ID matches this monomer.
  Tab Delimited (TSV)   2D SDfile   Computed 3D by Vconf -m prep SDfile
Find this compound or compounds like it in BindingDB:
Activity Spreadsheet -- Enzyme Inhibition Constant Data from BindingDB
Found 4 hits for monomerid = 92269
LigandPNGBDBM92269(CS259)
Affinity DataKi:  1nM ΔG°:  -12.3kcal/molepH: 7.0 T: 2°C. Assay description: OctetRed
In DepthDetails PubMed
TargetUDP-3-O-acyl-N-acetylglucosamine deacetylase(Pseudomonas aeruginosa)
D3R/Abbott
LigandPNGBDBM92269(CS259)
Affinity DataKd:  20.1nM. Assay description: Thermofluor_Method1
LigandPNGBDBM92269(CS259)
Affinity DataKd:  1.21E+3nMpH: 7.0 T: 2°C. Assay description: ITC
In DepthDetails PubMed
LigandPNGBDBM92269(CS259)
Affinity DataKd:  20nMpH: 7.0 T: 2°C. Assay description: Thermofluor
In DepthDetails PubMed