BDBM92277 CS270
SMILES ONC(=O)[C@H]1COC(=N1)c1ccc(OC(F)(F)F)c(Cl)c1
InChI Key InChIKey=RLAKMLLTALVONP-SSDOTTSWSA-N
Data  3 Kd
  Tab Delimited (TSV)   2D SDfile   Computed 3D by Vconf -m prep SDfile
Find this compound or compounds like it in BindingDB:
Activity Spreadsheet -- Enzyme Inhibition Constant Data from BindingDB
Found 3 hits for monomerid = 92277
LigandPNGBDBM92277(CS270)
Affinity DataKd:  744nMpH: 7.0 T: 2°C. Assay description: OctetRed
In DepthDetails PubMed
TargetUDP-3-O-acyl-N-acetylglucosamine deacetylase(Pseudomonas aeruginosa)
D3R/Abbott
LigandPNGBDBM92277(CS270)
Affinity DataKd:  3.80E+3nM. Assay description: Thermofluor_Method1
In DepthDetails PubMed
LigandPNGBDBM92277(CS270)
Affinity DataKd:  3.80E+3nMpH: 7.0 T: 2°C. Assay description: Thermofluor
In DepthDetails PubMed