BDBM92356 Chir98014, 20
SMILES Nc1nc(NCCNc2ncc(c(n2)-c2ccc(Cl)cc2Cl)-n2ccnc2)ccc1N(=O)=O
InChI Key InChIKey=MDZCSIDIPDZWKL-UHFFFAOYSA-N
Data  2 IC50
  Tab Delimited (TSV)   2D SDfile   Computed 3D by Vconf -m prep SDfile
Find this compound or compounds like it in BindingDB:
Activity Spreadsheet -- Enzyme Inhibition Constant Data from BindingDB
Found 2 hits for monomerid = 92356
TargetGlycogen synthase kinase-3 beta(Homo sapiens (Human))
Technische UniversitÄT Dortmund
LigandPNGBDBM92356(Chir98014, 20)
Affinity DataIC50:  4.10nM. Assay description: Inhibition of UmGSK3 by kinase inhibitors.
In DepthDetails ArticlePubMed
TargetPutative glycogen synthase kinase 3 alpha(Ustilago maydis (Smut fungus))
Technische UniversitÄT Dortmund
LigandPNGBDBM92356(Chir98014, 20)
Affinity DataIC50:  4.70nM. Assay description: Inhibition of UmGSK3 by kinase inhibitors.
In DepthDetails ArticlePubMed