BDBM92423 PU10
SMILES Cc1ncnc2nc[nH]c12
InChI Key InChIKey=SYMHUEFSSMBHJA-UHFFFAOYSA-N
Data  1 IC50
PDB links: 3 PDB IDs match this monomer.
  Tab Delimited (TSV)   2D SDfile   Computed 3D by Vconf -m prep SDfile
Find this compound or compounds like it in BindingDB:
Activity Spreadsheet -- Enzyme Inhibition Constant Data from BindingDB
Found 1 hit for monomerid = 92423
Target5-hydroxytryptamine receptor 3A(Homo sapiens (Human))
University Of Copenhagen
LigandPNGBDBM92423(PU10)
Affinity DataIC50: >1.00E+5nMpH: 7.4 T: 2°C. Assay description: The screening of the compound library at the h5-HT3A-HEK293 cell line and the subsequent functional characterization of the compounds were performed ...
In DepthDetails ArticlePubMed