BDBM92468 2-Thioxanthine, TX3
SMILES O=c1[nH]c(=S)n(CC2CCCO2)c2nc[nH]c12
InChI Key InChIKey=RSPDBEVKURKEII-UHFFFAOYSA-N
Data  1 IC50
  Tab Delimited (TSV)   2D SDfile   Computed 3D by Vconf -m prep SDfile
Find this compound or compounds like it in BindingDB:
Activity Spreadsheet -- Enzyme Inhibition Constant Data from BindingDB
Found 1 hit for monomerid = 92468
TargetMyeloperoxidase(Homo sapiens (Human))
Astrazeneca R&D
LigandPNGBDBM92468(2-Thioxanthine, TX3)
Affinity DataIC50:  400nMpH: 7.4 T: 2°C. Assay description: The chlorination activity of MPO was determined by measuring the production of hypocholorous acid.
In DepthDetails ArticlePubMed