BDBM92620 Benzimidamide, 6b
SMILES CCCCOc1cccc(c1)-c1cc(Oc2ccccc2)cc(c1)C(N)=N
InChI Key InChIKey=ILNLXEHLDZXTBQ-UHFFFAOYSA-N
Data  1 IC50
  Tab Delimited (TSV)   2D SDfile   Computed 3D by Vconf -m prep SDfile
Find this compound or compounds like it in BindingDB:
Activity Spreadsheet -- Enzyme Inhibition Constant Data from BindingDB
Found 1 hit for monomerid = 92620
TargetBeta-secretase 1(Homo sapiens (Human))
Peking University Health Science Center
LigandPNGBDBM92620(Benzimidamide, 6b)
Affinity DataIC50:  7.03E+3nM. Assay description: BACE1 inhibitory evaluation was carried out using a Fluorescence Resonance Energy Transfer (FRET) assay kit supplied by PanVera (kit P2985, Madison, ...
In DepthDetails ArticlePubMed