BDBM92660 C7-substituted chromone derivative, 3k
SMILES Cc1ccc(COc2ccc3c(c2)occc3=O)cc1
InChI Key InChIKey=OTOWGCWYIYPABF-UHFFFAOYSA-N
Data  2 IC50
  Tab Delimited (TSV)   2D SDfile   Computed 3D by Vconf -m prep SDfile
Find this compound or compounds like it in BindingDB:
Activity Spreadsheet -- Enzyme Inhibition Constant Data from BindingDB
Found 2 hits for monomerid = 92660
TargetAmine oxidase [flavin-containing] B(Homo sapiens (Human))
North-West University
LigandPNGBDBM92660(C7-substituted chromone derivative, 3k)
Affinity DataIC50:  75nMpH: 7.4 T: 2°C. Assay description: Inhibition studies using recombinant human MAO-A and MAO-B that were obtained from commercial sources (Sigma-Aldrich).
In DepthDetails ArticlePubMed
TargetAmine oxidase [flavin-containing] A(Homo sapiens (Human))
North-West University
LigandPNGBDBM92660(C7-substituted chromone derivative, 3k)
Affinity DataIC50:  7.12E+3nMpH: 7.4 T: 2°C. Assay description: Inhibition studies using recombinant human MAO-A and MAO-B that were obtained from commercial sources (Sigma-Aldrich).
In DepthDetails ArticlePubMed