BDBM9270 (3S)-1,1-dioxo--thiolan-3-yl N-[(2S,3R)-3-hydroxy-4-[(4-methoxybenzene)(2-methylpropyl)sulfonamido]-1-phenylbutan-2-yl]carbamate::(hydroxyethylamino)sulfonamide deriv. 9
SMILES [H][C@@]1(CCS(=O)(=O)C1)OC(=O)N[C@@H](Cc1ccccc1)[C@H](O)CN(CC(C)C)S(=O)(=O)c1ccc(OC)cc1
InChI Key InChIKey=JWYLJKYZDLQQHI-ZKMPZPQNSA-N
Data  1 KI
  Tab Delimited (TSV)   2D SDfile   Computed 3D by Vconf -m prep SDfile
Find this compound or compounds like it in BindingDB:
Activity Spreadsheet -- Enzyme Inhibition Constant Data from BindingDB
Found 1 hit for monomerid = 9270
TargetDimer of Gag-Pol polyprotein [501-599,Q508K,L534I,L564I,C568A,C596A](Human immunodeficiency virus type 1)
University Of Illinois At Chicago
LigandPNGBDBM9270((3S)-1,1-dioxo--thiolan-3-yl N-[(2S,3R)-3-hydroxy-...)
Affinity DataKi:  1.20nM ΔG°:  -12.2kcal/molepH: 6.4 T: 2°C. Assay description: The Ki values were determined using fluorogenic substrate, 2-(aminobenzoyl)-Thr-Ile-Nle-Phe(p-NO2)-Gln-ArgNH2. A standard curve relating changes in f...
In DepthDetails ArticlePubMed