BDBM92704 Photoaffinity ligand, 1
SMILES Clc1cc2Oc3cc(Cl)c(Cl)cc3Oc2c(c1)N=[N]#N
InChI Key InChIKey=RAFHNJIYLDUSHE-UHFFFAOYSA-N
Data  1 Kd
  Tab Delimited (TSV)   2D SDfile   Computed 3D by Vconf -m prep SDfile
Find this compound or compounds like it in BindingDB:
Activity Spreadsheet -- Enzyme Inhibition Constant Data from BindingDB
Found 1 hit for monomerid = 92704
TargetAryl hydrocarbon receptor(Mus musculus (Mouse))
University Of Wisconsin
LigandPNGBDBM92704(Photoaffinity ligand, 1)
Affinity DataKd:  0.440nMpH: 7.5 T: 2°C. Assay description: The equilibrium dissocation constants, KD values for the photoaffinity ligands were determined by a competitive binding assay.
Ligand InfoPC cidPC sid
In DepthDetails PubMed