BDBM9278 (3S,3aR,7aS)-hexahydro-2H-furo[2,3-b]pyran-3-yl N-[(2S,3R)-3-hydroxy-4-[(4-methoxybenzene)(2-methylpropyl)sulfonamido]-1-phenylbutan-2-yl]carbamate::(hydroxyethylamino)sulfonamide deriv. 16
SMILES [H][C@]1(CO[C@]2([H])OCCC[C@]12[H])OC(=O)N[C@@H](Cc1ccccc1)[C@H](O)CN(CC(C)C)S(=O)(=O)c1ccc(OC)cc1
InChI Key InChIKey=LDJWKKOBSVJUAX-QLHPUIKHSA-N
Data  1 KI
  Tab Delimited (TSV)   2D SDfile   Computed 3D by Vconf -m prep SDfile
Find this compound or compounds like it in BindingDB:
Activity Spreadsheet -- Enzyme Inhibition Constant Data from BindingDB
Found 1 hit for monomerid = 9278
TargetDimer of Gag-Pol polyprotein [501-599,Q508K,L534I,L564I,C568A,C596A](Human immunodeficiency virus type 1)
University Of Illinois At Chicago
LigandPNGBDBM9278((3S,3aR,7aS)-hexahydro-2H-furo[2,3-b]pyran-3-yl N-...)
Affinity DataKi:  2.20nM ΔG°:  -11.8kcal/molepH: 6.4 T: 2°C. Assay description: The Ki values were determined using fluorogenic substrate, 2-(aminobenzoyl)-Thr-Ile-Nle-Phe(p-NO2)-Gln-ArgNH2. A standard curve relating changes in f...
In DepthDetails ArticlePubMed