BDBM92883 S1602
SMILES CC(C)COc1ccc(C2CC2N)c(OCC(C)C)c1
InChI Key InChIKey=OCGLGYAHVKQNJU-UHFFFAOYSA-N
Data  1 IC50
  Tab Delimited (TSV)   2D SDfile   Computed 3D by Vconf -m prep SDfile
Find this compound or compounds like it in BindingDB:
Activity Spreadsheet -- Enzyme Inhibition Constant Data from BindingDB
Found 1 hit for monomerid = 92883
TargetLysine-specific histone demethylase 1A(Homo sapiens (Human))
Riken Systems And Structural Biology Center
LigandPNGBDBM92883(S1602)
Affinity DataIC50: >3.00E+4nM. Assay description: The kinetic inhibition parameters of LSD1 demethylase inhibition were obtained using the peroxidase-coupled reaction method.
In DepthDetails ArticlePubMed