BDBM93043 4-Methylester indole, 4
SMILES CC(=O)c1cccc2[nH]ccc12
InChI Key InChIKey=RUBNGGWBJUGNNA-UHFFFAOYSA-N
Data  1 Kd
  Tab Delimited (TSV)   2D SDfile   Computed 3D by Vconf -m prep SDfile
Find this compound or compounds like it in BindingDB:
Activity Spreadsheet -- Enzyme Inhibition Constant Data from BindingDB
Found 1 hit for monomerid = 93043
TargetDNA repair and recombination protein RadA(Pyrococcus furiosus)
University Of Cambridge
LigandPNGBDBM93043(4-Methylester indole, 4)
Affinity DataKd:  1.30E+6nM. Assay description: The thermal-shift denaturation assay was performed on an iCycler iQ Real Time Detection System (BioRad) in 96-well iCycler iQ PCR plates sealed with ...
In DepthDetails ArticlePubMed