BDBM93970 2-[2-(benzoylthiocarbamoylamino)thiazol-4-yl]acetic acid ethyl ester::2-[2-[[benzamido(sulfanylidene)methyl]amino]-4-thiazolyl]acetic acid ethyl ester::MLS000574621::SMR000196046::cid_805875::ethyl (2-{[(benzoylamino)carbonothioyl]amino}-1,3-thiazol-4-yl)acetate::ethyl 2-[2-(benzoylcarbamothioylamino)-1,3-thiazol-4-yl]acetate::ethyl 2-[2-(phenylcarbonylcarbamothioylamino)-1,3-thiazol-4-yl]ethanoate
SMILES CCOC(=O)Cc1csc(NC(=S)NC(=O)c2ccccc2)n1
InChI Key InChIKey=NZKFCGVVILYGBE-UHFFFAOYSA-N
Data  1 IC50
  Tab Delimited (TSV)   2D SDfile   Computed 3D by Vconf -m prep SDfile
Find this compound or compounds like it in BindingDB:
Activity Spreadsheet -- Enzyme Inhibition Constant Data from BindingDB
Found 1 hit for monomerid = 93970
TargetEndothelial PAS domain-containing protein 1(Homo sapiens (Human))
Burnham Center For Chemical Genomics
Curated by PubChem BioAssay
LigandPNGBDBM93970(2-[2-(benzoylthiocarbamoylamino)thiazol-4-yl]aceti...)
Affinity DataIC50:  3.69E+3nM
In DepthDetails PCBioAssay