BDBM94301 Benzo[1,3]dioxole-5-carboxylic acid isopropyl-[3-(4-methoxy-phenyl)-[1,2,4]oxadiazol-5-ylmethyl]-amide::MLS001223397::N-[[3-(4-methoxyphenyl)-1,2,4-oxadiazol-5-yl]methyl]-N-propan-2-yl-1,3-benzodioxole-5-carboxamide::N-isopropyl-N-[[3-(4-methoxyphenyl)-1,2,4-oxadiazol-5-yl]methyl]-piperonylamide::SMR000613535::cid_3164387
SMILES COc1ccc(cc1)-c1noc(CN(C(C)C)C(=O)c2ccc3OCOc3c2)n1
InChI Key InChIKey=TZJRSNGMBBXGAJ-UHFFFAOYSA-N
Data  1 IC50
  Tab Delimited (TSV)   2D SDfile   Computed 3D by Vconf -m prep SDfile
Find this compound or compounds like it in BindingDB:
Activity Spreadsheet -- Enzyme Inhibition Constant Data from BindingDB
Found 1 hit for monomerid = 94301
TargetNeuropilin-1(Homo sapiens (Human))
Burnham Center For Chemical Genomics
Curated by PubChem BioAssay
LigandPNGBDBM94301(Benzo[1,3]dioxole-5-carboxylic acid isopropyl-[3-(...)
Affinity DataIC50: >9.50E+4nM
In DepthDetails PCBioAssay