BDBM94362 (4-o-phenetylpiperazino)-(4-pyridyl)methanone::MLS000107993::SMR000103956::[4-(2-ethoxyphenyl)-1-piperazinyl]-pyridin-4-ylmethanone::[4-(2-ethoxyphenyl)piperazin-1-yl]-pyridin-4-yl-methanone::[4-(2-ethoxyphenyl)piperazin-1-yl]-pyridin-4-ylmethanone::cid_752969
SMILES CCOc1ccccc1N1CCN(CC1)C(=O)c1ccncc1
InChI Key InChIKey=SEAXKYBMSYYXNK-UHFFFAOYSA-N
Data  1 IC50
  Tab Delimited (TSV)   2D SDfile   Computed 3D by Vconf -m prep SDfile
Find this compound or compounds like it in BindingDB:
Activity Spreadsheet -- Enzyme Inhibition Constant Data from BindingDB
Found 1 hit for monomerid = 94362
TargetNeuropilin-1(Homo sapiens (Human))
Burnham Center For Chemical Genomics
Curated by PubChem BioAssay
LigandPNGBDBM94362((4-o-phenetylpiperazino)-(4-pyridyl)methanone | ML...)
Affinity DataIC50: >9.50E+4nM
In DepthDetails PCBioAssay