BDBM94571 MLS003674199::N-(2,6-dimethylphenyl)-2-(2-fluorophenyl)-2-[3-(2-furanyl)-2-oxo-1-quinoxalinyl]acetamide::N-(2,6-dimethylphenyl)-2-(2-fluorophenyl)-2-[3-(2-furyl)-2-keto-quinoxalin-1-yl]acetamide::N-(2,6-dimethylphenyl)-2-(2-fluorophenyl)-2-[3-(furan-2-yl)-2-oxidanylidene-quinoxalin-1-yl]ethanamide::N-(2,6-dimethylphenyl)-2-(2-fluorophenyl)-2-[3-(furan-2-yl)-2-oxoquinoxalin-1-yl]acetamide::SMR002353667::cid_53383324
SMILES Cc1cccc(C)c1NC(=O)C(c1ccccc1F)n1c2ccccc2nc(-c2ccco2)c1=O
InChI Key InChIKey=FOVPWKDDECJMTE-UHFFFAOYSA-N
Data  3 IC50
  Tab Delimited (TSV)   2D SDfile   Computed 3D by Vconf -m prep SDfile
Find this compound or compounds like it in BindingDB:
Activity Spreadsheet -- Enzyme Inhibition Constant Data from BindingDB
Found 3 hits for monomerid = 94571
TargetHepatocyte nuclear factor 4-alpha(Homo sapiens (Human))
The Scripps Research Institute Molecular Screening Center
Curated by PubChem BioAssay
LigandPNGBDBM94571(MLS003674199 | N-(2,6-dimethylphenyl)-2-(2-fluorop...)
Affinity DataIC50:  2.48E+3nM
In DepthDetails PCBioAssay
TargetPerilipin-5(Homo sapiens (Human))
The Scripps Research Institute Molecular Screening Center
Curated by PubChem BioAssay
LigandPNGBDBM94571(MLS003674199 | N-(2,6-dimethylphenyl)-2-(2-fluorop...)
Affinity DataIC50:  2.73E+3nM
In DepthDetails PCBioAssay
TargetPerilipin-1(Homo sapiens (Human))
The Scripps Research Institute Molecular Screening Center
Curated by PubChem BioAssay
LigandPNGBDBM94571(MLS003674199 | N-(2,6-dimethylphenyl)-2-(2-fluorop...)
Affinity DataIC50:  2.81E+3nM
In DepthDetails PCBioAssay