BDBM94590 2-(1-benzofuran-2-yl)-2-[3-(furan-2-yl)-2-oxidanylidene-quinoxalin-1-yl]-N-pentyl-ethanamide::2-(1-benzofuran-2-yl)-2-[3-(furan-2-yl)-2-oxoquinoxalin-1-yl]-N-pentylacetamide::2-(2-benzofuranyl)-2-[3-(2-furanyl)-2-oxo-1-quinoxalinyl]-N-pentylacetamide::MLS003674165::N-amyl-2-(benzofuran-2-yl)-2-[3-(2-furyl)-2-keto-quinoxalin-1-yl]acetamide::SMR002353633::cid_53383147
SMILES CCCCCNC(=O)C(c1cc2ccccc2o1)n1c2ccccc2nc(-c2ccco2)c1=O
InChI Key InChIKey=ZIKHGWGHETUMGV-UHFFFAOYSA-N
Data  3 IC50
  Tab Delimited (TSV)   2D SDfile   Computed 3D by Vconf -m prep SDfile
Find this compound or compounds like it in BindingDB:
Activity Spreadsheet -- Enzyme Inhibition Constant Data from BindingDB
Found 3 hits for monomerid = 94590
TargetHepatocyte nuclear factor 4-alpha(Homo sapiens (Human))
The Scripps Research Institute Molecular Screening Center
Curated by PubChem BioAssay
LigandPNGBDBM94590(2-(1-benzofuran-2-yl)-2-[3-(furan-2-yl)-2-oxidanyl...)
Affinity DataIC50:  2.01E+3nM
In DepthDetails PCBioAssay
TargetPerilipin-5(Homo sapiens (Human))
The Scripps Research Institute Molecular Screening Center
Curated by PubChem BioAssay
LigandPNGBDBM94590(2-(1-benzofuran-2-yl)-2-[3-(furan-2-yl)-2-oxidanyl...)
Affinity DataIC50:  1.16E+3nM
In DepthDetails PCBioAssay
TargetPerilipin-1(Homo sapiens (Human))
The Scripps Research Institute Molecular Screening Center
Curated by PubChem BioAssay
LigandPNGBDBM94590(2-(1-benzofuran-2-yl)-2-[3-(furan-2-yl)-2-oxidanyl...)
Affinity DataIC50:  1.48E+3nM
In DepthDetails PCBioAssay