BDBM94709 4-(azepan-1-ylcarbonyl)-2-(4-ethoxyphenyl)-6,7-dimethoxy-isoquinolin-1-one::4-(azepan-1-ylcarbonyl)-2-(4-ethoxyphenyl)-6,7-dimethoxyisoquinolin-1(2H)-one::4-(azepane-1-carbonyl)-2-(4-ethoxyphenyl)-6,7-dimethoxyisoquinolin-1-one::4-(azepane-1-carbonyl)-6,7-dimethoxy-2-p-phenetyl-isocarbostyril::4-[1-azepanyl(oxo)methyl]-2-(4-ethoxyphenyl)-6,7-dimethoxy-1-isoquinolinone::MLS000086366::SMR000021868::cid_3237252
SMILES CCOc1ccc(cc1)-n1cc(C(=O)N2CCCCCC2)c2cc(OC)c(OC)cc2c1=O
InChI Key InChIKey=HAIWXHVWIBAESO-UHFFFAOYSA-N
Data  1 IC50  1 EC50
  Tab Delimited (TSV)   2D SDfile   Computed 3D by Vconf -m prep SDfile
Find this compound or compounds like it in BindingDB:
Activity Spreadsheet -- Enzyme Inhibition Constant Data from BindingDB
Found 2 hits for monomerid = 94709
LigandPNGBDBM94709(4-(azepan-1-ylcarbonyl)-2-(4-ethoxyphenyl)-6,7-dim...)
Affinity DataIC50:  1.80E+3nM. Assay description: Antagonist activity at rat LPA5 receptor expressed in CHO cells assessed as inhibition of LPA-induced cAMP accumulation after 30 mins by Lance Ultra ...
In DepthDetails ArticlePubMed
TargetXylosyl- and glucuronyltransferase LARGE1(Homo sapiens (Human))
Burnham Center For Chemical Genomics
Curated by PubChem BioAssay
LigandPNGBDBM94709(4-(azepan-1-ylcarbonyl)-2-(4-ethoxyphenyl)-6,7-dim...)
Affinity DataEC50:  5.60E+3nM
In DepthDetails PCBioAssay