BDBM94741 1-(3-chloranyl-4-fluoranyl-phenyl)-3-[[1-[(3-methylphenyl)methyl]piperidin-4-yl]methyl]urea::1-(3-chloro-4-fluoro-phenyl)-3-[[1-(3-methylbenzyl)-4-piperidyl]methyl]urea::1-(3-chloro-4-fluorophenyl)-3-[[1-[(3-methylphenyl)methyl]-4-piperidinyl]methyl]urea::1-(3-chloro-4-fluorophenyl)-3-[[1-[(3-methylphenyl)methyl]piperidin-4-yl]methyl]urea::MLS001200217::N-(3-chloro-4-fluorophenyl)-N'-{[1-(3-methylbenzyl)piperidin-4-yl]methyl}urea::SMR000563489::cid_23609268
SMILES Cc1cccc(CN2CCC(CNC(=O)Nc3ccc(F)c(Cl)c3)CC2)c1
InChI Key InChIKey=BKYIVNQKSIGXRM-UHFFFAOYSA-N
Data  1 EC50
  Tab Delimited (TSV)   2D SDfile   Computed 3D by Vconf -m prep SDfile
Find this compound or compounds like it in BindingDB:
Activity Spreadsheet -- Enzyme Inhibition Constant Data from BindingDB
Found 1 hit for monomerid = 94741
TargetXylosyl- and glucuronyltransferase LARGE1(Homo sapiens (Human))
Burnham Center For Chemical Genomics
Curated by PubChem BioAssay
LigandPNGBDBM94741(1-(3-chloranyl-4-fluoranyl-phenyl)-3-[[1-[(3-methy...)
Affinity DataEC50:  8.57E+3nM
In DepthDetails PCBioAssay