BDBM94970 1-(3,4-dihydroxyphenyl)-2-(methylamino)ethanone::1-[3,4-bis(oxidanyl)phenyl]-2-(methylamino)ethanone::MLS001032115::SMR000718615::cid_7436
SMILES CNCC(=O)c1ccc(O)c(O)c1
InChI Key InChIKey=PZMVOUYYNKPMSI-UHFFFAOYSA-N
Data  3 IC50
  Tab Delimited (TSV)   2D SDfile   Computed 3D by Vconf -m prep SDfile
Find this compound or compounds like it in BindingDB:
Activity Spreadsheet -- Enzyme Inhibition Constant Data from BindingDB
Found 3 hits for monomerid = 94970
TargetLow molecular weight phosphotyrosine protein phosphatase(Homo sapiens (Human))
Burnham Center For Chemical Genomics
Curated by PubChem BioAssay
LigandPNGBDBM94970(1-(3,4-dihydroxyphenyl)-2-(methylamino)ethanone | ...)
Affinity DataIC50: >8.00E+4nM
In DepthDetails PCBioAssay
TargetD-amino-acid oxidase(Homo sapiens (Human))
Kitasato University
Curated by ChEMBL
LigandPNGBDBM94970(1-(3,4-dihydroxyphenyl)-2-(methylamino)ethanone | ...)
Affinity DataIC50: >1.00E+6nM. Assay description: Inhibition of human recombinant N-terminal His-tagged DAO expressed in Escherichia coli BL21(DE3) using D-serine as substrate by colorimetric assay
In DepthDetails ArticlePubMed
TargetLow molecular weight phosphotyrosine protein phosphatase(Homo sapiens (Human))
Burnham Center For Chemical Genomics
Curated by PubChem BioAssay
LigandPNGBDBM94970(1-(3,4-dihydroxyphenyl)-2-(methylamino)ethanone | ...)
Affinity DataIC50: >8.00E+4nM
In DepthDetails PCBioAssay