BDBM95797 (12aS)-2-cyclopropyl-6-(3-methoxyphenyl)-6,7,12,12a-tetrahydro-3H-pyrazino[1,2-b]-carboline-1,4-quinone::MLS001213202::SMR000542944::cid_16399554
SMILES COc1cccc(c1)C1N2[C@@H](Cc3c1[nH]c1ccccc31)C(=O)N(CC2=O)C1CC1
InChI Key InChIKey=LKCAINTVKLHVBF-AJZOCDQUSA-N
Data  1 IC50
  Tab Delimited (TSV)   2D SDfile   Computed 3D by Vconf -m prep SDfile
Find this compound or compounds like it in BindingDB:
Activity Spreadsheet -- Enzyme Inhibition Constant Data from BindingDB
Found 1 hit for monomerid = 95797
TargetMethionine--tRNA ligase(Trypanosoma brucei brucei strain 927/4 GUTat10.1)
The Scripps Research Institute Molecular Screening Center
Curated by PubChem BioAssay
LigandPNGBDBM95797((12aS)-2-cyclopropyl-6-(3-methoxyphenyl)-6,7,12,12...)
Affinity DataIC50:  3.68E+4nM
In DepthDetails PCBioAssay