BDBM95968 MLS001031480::N-[(2-hydroxy-5-sec-butyl-phenyl)thiocarbamoyl]thiophene-2-carboxamide::N-[(5-butan-2-yl-2-hydroxyanilino)-sulfanylidenemethyl]-2-thiophenecarboxamide::N-[(5-butan-2-yl-2-hydroxyphenyl)carbamothioyl]thiophene-2-carboxamide::N-[(5-butan-2-yl-2-oxidanyl-phenyl)carbamothioyl]thiophene-2-carboxamide::SMR000659671::cid_2893531
SMILES CCC(C)c1ccc(O)c(NC(=S)NC(=O)c2cccs2)c1
InChI Key InChIKey=UTQSIXMUPXYHHE-UHFFFAOYSA-N
Data  1 EC50
  Tab Delimited (TSV)   2D SDfile   Computed 3D by Vconf -m prep SDfile
Find this compound or compounds like it in BindingDB:
Activity Spreadsheet -- Enzyme Inhibition Constant Data from BindingDB
Found 1 hit for monomerid = 95968
TargetTumor necrosis factor receptor superfamily member 10B(Homo sapiens (Human))
Burnham Center For Chemical Genomics
Curated by PubChem BioAssay
LigandPNGBDBM95968(MLS001031480 | N-[(2-hydroxy-5-sec-butyl-phenyl)th...)
Affinity DataEC50:  7.07E+3nM
In DepthDetails PCBioAssay