BDBM96029 1-piperidinecarbodithioic acid phenacyl ester::MLS000677287::SMR000286054::cid_325090::phenacyl piperidine-1-carbodithioate::piperidine-1-carbodithioic acid phenacyl ester
SMILES O=C(CSC(=S)N1CCCCC1)c1ccccc1
InChI Key InChIKey=ADVJDPHBXVNOPS-UHFFFAOYSA-N
Data  1 EC50
  Tab Delimited (TSV)   2D SDfile   Computed 3D by Vconf -m prep SDfile
Find this compound or compounds like it in BindingDB:
Activity Spreadsheet -- Enzyme Inhibition Constant Data from BindingDB
Found 1 hit for monomerid = 96029
TargetTumor necrosis factor receptor superfamily member 10B(Homo sapiens (Human))
Burnham Center For Chemical Genomics
Curated by PubChem BioAssay
LigandPNGBDBM96029(1-piperidinecarbodithioic acid phenacyl ester | ML...)
Affinity DataEC50: >1.25E+4nM
In DepthDetails PCBioAssay