BDBM96484 2-[(Z)-2-(3-ethoxy-4-sec-butoxy-phenyl)vinyl]-4-hydroxy-5-nitro-1H-pyrimidin-6-one::2-[(Z)-2-(4-butan-2-yloxy-3-ethoxy-phenyl)ethenyl]-5-nitro-4-oxidanyl-1H-pyrimidin-6-one::2-[(Z)-2-(4-butan-2-yloxy-3-ethoxyphenyl)ethenyl]-4-hydroxy-5-nitro-1H-pyrimidin-6-one::2-[(Z)-2-(4-sec-Butoxy-3-ethoxy-phenyl)-vinyl]-6-hydroxy-5-nitro-3H-pyrimidin-4-one::MLS001202517::SMR000524345::cid_5769380
SMILES CCOc1cc(C=Cc2nc(O)c([N+]([O-])=O)c(=O)[nH]2)ccc1OC(C)CC
InChI Key InChIKey=RPTSTMJEGACHCP-CLFYSBASSA-N
Data  1 IC50
  Tab Delimited (TSV)   2D SDfile   Computed 3D by Vconf -m prep SDfile
Find this compound or compounds like it in BindingDB:
Activity Spreadsheet -- Enzyme Inhibition Constant Data from BindingDB
Found 1 hit for monomerid = 96484
TargetHuntingtin(Homo sapiens (Human))
The Scripps Research Institute Molecular Screening Center
Curated by PubChem BioAssay
LigandPNGBDBM96484(2-[(Z)-2-(3-ethoxy-4-sec-butoxy-phenyl)vinyl]-4-hy...)
Affinity DataIC50:  4.16E+3nM
In DepthDetails PCBioAssay