BDBM96547 MLS003127596::N-[4-(butylcarbamoylsulfamoyl)phenyl]-2-[5-(4-methylphenyl)thieno[2,3-d]pyrimidin-4-yl]sulfanyl-ethanamide::N-[4-(butylcarbamoylsulfamoyl)phenyl]-2-[5-(4-methylphenyl)thieno[2,3-d]pyrimidin-4-yl]sulfanylacetamide::N-[4-(butylcarbamoylsulfamoyl)phenyl]-2-[[5-(p-tolyl)thieno[2,3-d]pyrimidin-4-yl]thio]acetamide::N-[4-[[butylamino(oxo)methyl]sulfamoyl]phenyl]-2-[[5-(4-methylphenyl)-4-thieno[2,3-d]pyrimidinyl]thio]acetamide::SMR001835661::cid_16439218
SMILES CCCCNC(=O)NS(=O)(=O)c1ccc(NC(=O)CSc2ncnc3scc(-c4ccc(C)cc4)c23)cc1
InChI Key InChIKey=LVBWIUVTHZYRIZ-UHFFFAOYSA-N
Data  1 IC50
  Tab Delimited (TSV)   2D SDfile   Computed 3D by Vconf -m prep SDfile
Find this compound or compounds like it in BindingDB:
Activity Spreadsheet -- Enzyme Inhibition Constant Data from BindingDB
Found 1 hit for monomerid = 96547
TargetHuntingtin(Homo sapiens (Human))
The Scripps Research Institute Molecular Screening Center
Curated by PubChem BioAssay
LigandPNGBDBM96547(MLS003127596 | N-[4-(butylcarbamoylsulfamoyl)pheny...)
Affinity DataIC50:  3.33E+3nM
In DepthDetails PCBioAssay