BDBM96589 BETAHISTINE DIHYDROCHLORIDE::CHEMBL24441::MLS000069505::N-methyl-2-(2-pyridinyl)ethanamine;hydrochloride::N-methyl-2-pyridin-2-yl-ethanamine;hydrochloride::N-methyl-2-pyridin-2-ylethanamine;hydrochloride::SMR000058622::cid_203875::methyl-[2-(2-pyridyl)ethyl]amine;hydrochloride
SMILES CNCCc1ccccn1
InChI Key InChIKey=UUQMNUMQCIQDMZ-UHFFFAOYSA-N
Data  1 KI  2 IC50  2 EC50
  Tab Delimited (TSV)   2D SDfile   Computed 3D by Vconf -m prep SDfile
Find this compound or compounds like it in BindingDB:
Activity Spreadsheet -- Enzyme Inhibition Constant Data from BindingDB
Found 5 hits for monomerid = 96589
TargetHistamine H3 receptor(Rattus norvegicus (rat))
F. Hoffmann-La Roche
Curated by ChEMBL
LigandPNGBDBM96589(BETAHISTINE DIHYDROCHLORIDE | CHEMBL24441 | MLS000...)
Affinity DataKi:  2.03E+3nM. Assay description: Binding affinity to rat histamine H3 receptor
In DepthDetails ArticlePubMed
TargetTrace amine-associated receptor 1(Homo sapiens (Human))
The Scripps Research Institute Molecular Screening Center
Curated by PubChem BioAssay
LigandPNGBDBM96589(BETAHISTINE DIHYDROCHLORIDE | CHEMBL24441 | MLS000...)
Affinity DataIC50:  6.02E+3nM
In DepthDetails PCBioAssay
TargetGuanine nucleotide-binding protein subunit alpha-15(Homo sapiens (Human))
The Scripps Research Institute Molecular Screening Center
Curated by PubChem BioAssay
LigandPNGBDBM96589(BETAHISTINE DIHYDROCHLORIDE | CHEMBL24441 | MLS000...)
Affinity DataIC50: >2.99E+4nM
In DepthDetails PCBioAssay
TargetGuanine nucleotide-binding protein subunit alpha-15(Homo sapiens (Human))
The Scripps Research Institute Molecular Screening Center
Curated by PubChem BioAssay
LigandPNGBDBM96589(BETAHISTINE DIHYDROCHLORIDE | CHEMBL24441 | MLS000...)
Affinity DataEC50: >2.99E+4nM
In DepthDetails PCBioAssay
TargetTrace amine-associated receptor 1(Homo sapiens (Human))
The Scripps Research Institute Molecular Screening Center
Curated by PubChem BioAssay
LigandPNGBDBM96589(BETAHISTINE DIHYDROCHLORIDE | CHEMBL24441 | MLS000...)
Affinity DataEC50:  1.25E+3nM
In DepthDetails PCBioAssay