BDBM96611 4-[(2E)-2-benzylidenehydrazinyl]-5-chloro-1H-pyridazin-6-one::4-[(N'E)-N'-benzalhydrazino]-5-chloro-1H-pyridazin-6-one::5-chloranyl-4-[(2E)-2-(phenylmethylidene)hydrazinyl]-1H-pyridazin-6-one::5-chloro-4-[(2E)-2-(phenylmethylene)hydrazinyl]-1H-pyridazin-6-one::MLS000521389::SMR000131797::cid_9569641
SMILES Clc1c(cn[nH]c1=O)N=NCc1ccccc1
InChI Key InChIKey=BYLHDQCUECQQDQ-FYWRMAATSA-N
Data  2 IC50  2 EC50
  Tab Delimited (TSV)   2D SDfile   Computed 3D by Vconf -m prep SDfile
Find this compound or compounds like it in BindingDB:
Activity Spreadsheet -- Enzyme Inhibition Constant Data from BindingDB
Found 4 hits for monomerid = 96611
TargetGuanine nucleotide-binding protein subunit alpha-15(Homo sapiens (Human))
The Scripps Research Institute Molecular Screening Center
Curated by PubChem BioAssay
LigandPNGBDBM96611(4-[(2E)-2-benzylidenehydrazinyl]-5-chloro-1H-pyrid...)
Affinity DataEC50: >2.99E+4nM
In DepthDetails PCBioAssay
TargetGuanine nucleotide-binding protein subunit alpha-15(Homo sapiens (Human))
The Scripps Research Institute Molecular Screening Center
Curated by PubChem BioAssay
LigandPNGBDBM96611(4-[(2E)-2-benzylidenehydrazinyl]-5-chloro-1H-pyrid...)
Affinity DataIC50: >2.99E+4nM
In DepthDetails PCBioAssay
TargetTrace amine-associated receptor 1(Homo sapiens (Human))
The Scripps Research Institute Molecular Screening Center
Curated by PubChem BioAssay
LigandPNGBDBM96611(4-[(2E)-2-benzylidenehydrazinyl]-5-chloro-1H-pyrid...)
Affinity DataEC50:  290nM
In DepthDetails PCBioAssay
TargetTrace amine-associated receptor 1(Homo sapiens (Human))
The Scripps Research Institute Molecular Screening Center
Curated by PubChem BioAssay
LigandPNGBDBM96611(4-[(2E)-2-benzylidenehydrazinyl]-5-chloro-1H-pyrid...)
Affinity DataIC50:  981nM
In DepthDetails PCBioAssay