BDBM96637 (3,5-Dimethoxy-benzylidene)-isochroman-1-ylmethyl-amine::(3,5-dimethoxybenzylidene)-(isochroman-1-ylmethyl)amine::MLS000569452::N-(3,4-dihydro-1H-2-benzopyran-1-ylmethyl)-1-(3,5-dimethoxyphenyl)methanimine::N-(3,4-dihydro-1H-isochromen-1-ylmethyl)-1-(3,5-dimethoxyphenyl)methanimine::SMR000176101::cid_3119442
SMILES COc1cc(OC)cc(\C=N\CC2OCCc3ccccc23)c1
InChI Key InChIKey=IPTZVBJMDLXKST-UDWIEESQSA-N
Data  2 IC50  2 EC50
  Tab Delimited (TSV)   2D SDfile   Computed 3D by Vconf -m prep SDfile
Find this compound or compounds like it in BindingDB:
Activity Spreadsheet -- Enzyme Inhibition Constant Data from BindingDB
Found 4 hits for monomerid = 96637
TargetGuanine nucleotide-binding protein subunit alpha-15(Homo sapiens (Human))
The Scripps Research Institute Molecular Screening Center
Curated by PubChem BioAssay
LigandPNGBDBM96637((3,5-Dimethoxy-benzylidene)-isochroman-1-ylmethyl-...)
Affinity DataEC50: >2.99E+4nM
In DepthDetails PCBioAssay
TargetGuanine nucleotide-binding protein subunit alpha-15(Homo sapiens (Human))
The Scripps Research Institute Molecular Screening Center
Curated by PubChem BioAssay
LigandPNGBDBM96637((3,5-Dimethoxy-benzylidene)-isochroman-1-ylmethyl-...)
Affinity DataIC50: >2.99E+4nM
In DepthDetails PCBioAssay
TargetTrace amine-associated receptor 1(Homo sapiens (Human))
The Scripps Research Institute Molecular Screening Center
Curated by PubChem BioAssay
LigandPNGBDBM96637((3,5-Dimethoxy-benzylidene)-isochroman-1-ylmethyl-...)
Affinity DataEC50:  100nM
In DepthDetails PCBioAssay
TargetTrace amine-associated receptor 1(Homo sapiens (Human))
The Scripps Research Institute Molecular Screening Center
Curated by PubChem BioAssay
LigandPNGBDBM96637((3,5-Dimethoxy-benzylidene)-isochroman-1-ylmethyl-...)
Affinity DataIC50:  618nM
In DepthDetails PCBioAssay