BDBM96825 (2-methoxy-6-methyl-phenyl)-(2-oxazolin-2-yl)amine::MLS003106542::N-(2-methoxy-6-methyl-phenyl)-4,5-dihydro-1,3-oxazol-2-amine::N-(2-methoxy-6-methylphenyl)-4,5-dihydro-1,3-oxazol-2-amine::N-(2-methoxy-6-methylphenyl)-4,5-dihydrooxazol-2-amine::SMR001821441::cid_98724
SMILES COc1cccc(C)c1N=C1NCCO1
InChI Key InChIKey=AAYGWMVNFUJRJN-UHFFFAOYSA-N
Data  2 IC50  2 EC50
  Tab Delimited (TSV)   2D SDfile   Computed 3D by Vconf -m prep SDfile
Find this compound or compounds like it in BindingDB:
Activity Spreadsheet -- Enzyme Inhibition Constant Data from BindingDB
Found 4 hits for monomerid = 96825
TargetGuanine nucleotide-binding protein subunit alpha-15(Homo sapiens (Human))
The Scripps Research Institute Molecular Screening Center
Curated by PubChem BioAssay
LigandPNGBDBM96825((2-methoxy-6-methyl-phenyl)-(2-oxazolin-2-yl)amine...)
Affinity DataEC50: >2.99E+4nM
Ligand InfoPC cidPC sid
In DepthDetails PCBioAssay
TargetGuanine nucleotide-binding protein subunit alpha-15(Homo sapiens (Human))
The Scripps Research Institute Molecular Screening Center
Curated by PubChem BioAssay
LigandPNGBDBM96825((2-methoxy-6-methyl-phenyl)-(2-oxazolin-2-yl)amine...)
Affinity DataIC50: >2.99E+4nM
Ligand InfoPC cidPC sid
In DepthDetails PCBioAssay
TargetTrace amine-associated receptor 1(Homo sapiens (Human))
The Scripps Research Institute Molecular Screening Center
Curated by PubChem BioAssay
LigandPNGBDBM96825((2-methoxy-6-methyl-phenyl)-(2-oxazolin-2-yl)amine...)
Affinity DataEC50:  735nM
Ligand InfoPC cidPC sid
In DepthDetails PCBioAssay
TargetTrace amine-associated receptor 1(Homo sapiens (Human))
The Scripps Research Institute Molecular Screening Center
Curated by PubChem BioAssay
LigandPNGBDBM96825((2-methoxy-6-methyl-phenyl)-(2-oxazolin-2-yl)amine...)
Affinity DataIC50:  4.12E+3nM
Ligand InfoPC cidPC sid
In DepthDetails PCBioAssay